{"text_format":"1","workbook":"xlsx","n_sheets":7,"sheets":["Instructions","Prework","Audit Checklist","CAPA Tracking","Evaluation","List of supportive documents","Revision Tracking"],"not_rendered":{"charts":1,"images":8,"macros":1,"external_links":6,"defined_names":79,"comments":2,"pivot_tables":0},"unopened":[],"bounds":{"document_bytes":16777216,"sheet_cells":100000,"rows_first":2000,"rows_last":500,"rows_between":2000,"halvings":0,"cell_chars":16384,"cell_head_chars":4096},"cells_cut":0,"cells_raw":0,"read":"whole","date_system":"1900"}

{"sheet":"Instructions","index":0,"n_rows":66,"n_cols":5,"rows_kept":66,"cut":false,"hidden":false,"merged":[[1,1,2,9],[3,4,3,6],[41,3,41,4]]}
[]
[null,"ABB Electrification GATE1 Supplier Qualification Generic Audit Checklist"]
[]
[null,"Information and Instructions"]
[]
[]
[null,"PURPOSE"]
[null,"This document is developed as an Audit Tool to qualify new or existing suppliers"]
[]
[null,"SCOPE"]
[null,"The  Audit checklist  is primarily intended to be used for New or Existing direct material supplier, manufacturers  for ABB."]
[]
[null,"HOW TO"]
[null,"Please (have the supplier) fill all requested information in the PreWork Sheet and Audit Checklist tabs"]
[null,"Please fill the header of Audit Checklist tab with info. Add a unique report id number by following the coding rules:"]
{"$rows_left_out":52}
{"sheet":"Prework","index":1,"n_rows":64,"n_cols":15,"rows_kept":64,"cut":false,"hidden":false,"merged":[[62,2,62,14],[65,2,65,12],[65,13,65,14],[55,12,55,13],[56,12,56,13],[57,12,57,13],[58,12,58,13],[59,12,59,13],[64,2,64,12],[64,13,64,14],[63,2,63,12],[63,13,63,14],[46,1,46,15],[48,2,48,14],[55,2,55,3],[55,4,55,11],[60,12,60,13],[12,10,12,11],[13,2,13,4],[13,5,13,7],[12,5,12,7],[44,2,44,5],[44,6,44,8],[44,9,44,14],[4,1,4,15],[7,2,7,4],[7,5,7,7],[11,5,11,7],[5,1,5,15],[7,10,7,11],[8,2,8,4],[8,5,8,7],[9,10,9,11],[11,2,11,4],[15,2,15,4],[15,5,15,7],[14,13,14,14],[15,10,15,11],[24,2,24,14],[16,2,16,4],[16,5,16,7],[17,2,17,4],[17,5,17,7],[18,2,18,4],[18,5,18,7],[19,2,19,4],[19,5,19,7],[20,2,20,4],[20,5,20,7],[21,2,21,4],[21,5,21,7],[40,2,40,5],[40,6,40,8],[40,9,40,14],[25,2,25,14],[26,2,26,14],[27,2,27,14],[28,2,28,14],[29,2,29,14],[30,2,30,14],[33,2,33,14],[43,2,43,5],[43,6,43,8],[43,9,43,14],[1,9,2,11],[69,10,70,12],[41,2,41,5],[41,6,41,8],[41,9,41,14],[42,2,42,5],[42,6,42,8],[42,9,42,14],[31,2,31,14],[32,2,32,14],[47,2,47,14],[50,3,50,4],[51,3,51,4],[49,5,49,11],[49,12,49,13],[50,5,50,11],[52,3,52,4],[54,2,54,14]]}
[]
[]
[]
[null,"*TO BE FILLED OUT BY SUPPLIER"]
[null,"Supplier Information"]
[null,"Supplier Information"]
[null,null,"A)  Description of the Auditee (site audited):",null,null,null,null,null,null,null,"B)  Key Contacts at Auditee:"]
[null,null,"Have ISO Certificate? (Y/N)",null,null,"Yes",null,null,null,null,"Quality Manager:",null,null,"Phone:","M (803) 968-2859 "]
[null,null,"Which ISO standards?",null,null,"9001:2015",null,null,null,null,"Name:","Patrick Macias ",null,"Email:","pmacias@jemisonmetals.com"]
[null,null,null,null,null,null,null,null,null,null,"Operations Manager:",null,null,"Phone:","803-968-3173"]
[null,null,null,null,null,null,null,null,null,null,"Name:","Marion Pitts",null,"Email:","mpitts@jemisonmetals.com"]
[null,null,"Date of last third parties external audit:",null,null,"2022-03-11"]
[null,null,"External audit result ( # NCs):",null,null,0,null,null,null,null,"Engineering Manager:",null,null,"Phone:","205-910-0485"]
[null,null,"3 month rolling DPPM:",null,null,2996,null,null,null,null,"Name:","Rick Rowland",null,"Email:","rrowland@jemisonmetals.com"]
[null,null,"DPPM Trend",null,null,"Provided"]
{"$rows_left_out":50}
{"sheet":"Audit Checklist","index":2,"n_rows":116,"n_cols":7,"rows_kept":116,"cut":false,"hidden":false,"merged":[[8,2,8,3],[7,2,7,3],[1,2,1,3],[2,2,2,3],[3,2,3,3],[4,2,4,3],[5,2,5,3],[6,2,6,3]]}
[]
[null,"Supplier Name:","Jemison Steel Site Audit"]
[null,"Supplier site (Address):","1255 North Gate Drive  Sumter, SC 29154"]
[null,"Supplier GUID:"]
[null,"Audit Date:","May 2nd 2024"]
[null,"ABB Lead Auditor:","Henry George"]
[null,"ABB Participants: ","Shri Mehta,  Roberto Arroya  Jennifer Robison"]
[null,"ABB BA and Division conducting the audit:"]
[null,"Audit report id:"]
[]
["Sr. No.","1. Compliance (HSE, sustainability, SRG)","Audit Area","Scoring guide","Score","Improvement type","Comment"]
["1.1","During  the facility tour (including outside premises), did  any concern arose on the following areas: noise, air emissions, waste disposal, water discharges?\n(Look for: excessive noise levels and boundary, visible haze or chemical mist or dust, abnormal vegetation, waterways, hazardous waste storage)","Factory Tour, \nHSE","0 - Pollution observed to the air, waste water discharged to public drain or to soil, abnormal vegetation conditions, excessive noise and located in a residential area.\n1 - Local authority permits in process, concerns found but corrective actions in place to mitigate problem.\n2 - Plant located in a residential area but have all law permits to operate.\n3 - During plant inspection/tour, no evidence found of environmental threats or breach, hazardous material and chemical containers well storage and disposed.",3,null,"Jemison uses an outside certified hazmat business to handle disposal of hazardous materials. Jemison's air emissions and water discharges are minimal, near to zero. Noise protection levels and hearing ability checks for employees on periodic level."]
["1.2\n","Is there a medical surveillance program in place to monitor personnel health conditions? Are there First Aid Kits (FAK) available, suitable for the purpose, conisdering the size of the facility, type of hazards and number of employees? \n","Meeting Room,\nFactory Tour, \nHSE","0 - No plan or FAK in place.\n1 - Considered but not consistent.\n2 - General program in place, not focused on individuals or areas of concern due to the type of work executed. FAK in some places, but content not complete, or expiry dates of materilas have run out.\n3 - Extensive and comprehensive program to monitor employees health, including follow up and relocation programs if necessary.  Metrics established and monitored.",2,null,"FAK in place. An outside contractor reviews and replenishes inventory monthly. Have people get certified for First Aid training.  No medical surveilance program for employees."]
["1.3","While doing the plant tour, have any concerns been identified regarding: electrical safety, machine guarding, or other risk on employees due to improper working practices?\n(Check: electrical cables and boards conditions, rotatory or machinery with movement guarding)","Factory Tour, \nHSE","0 - Poor electrical wiring, no guards on machinery.\n1 - Just some guards observed.  Found electrical wiring in bad conditions.\n2 - The majority of the wiring and electrical installations are professionally made.  Guards on all expose to employee machinery\n3 - Electrical wiring in good conditions, boards and switches identified and locked where needed.  Guards in place (light curtains, physical, etc.)",2,"Meet Requirement","All wiring is protected and professionally made. One machine with poor wiring was observed."]
["1.4","Are employees wearing the appropriate personal protective equipment when necessary, such as specific masks, hearing protection equipment, eye protection measures, safety shoes, gloves, etc..\n","Factory Tour, \nHSE","0 - Personnel performing operations with no PPE or high risk operations.\n1 - Confusion on what and where to wear PPE, no clear signs to identify what to use. Some level of PPE been used.\n2 - Employees wearing proper PPE, areas of opportunity on signs and instructions.\n3 - Evidence of training program in place to make people conscious  about high risks, auto evaluations on PPE importance. ",1,"Observation","All floor personnel are required to wear the same PPE regardless of position in plant. Safety glasses and safety shoes. Employees not wearing hearing protection as observed. Review with OSHA the requirement for hard hats. There should be a signage indicating which area needs the hearing protection.   1910.95  Occupational noise exposure  OSHA Hearing conservation program - whenever noise exposures equal or exceed 8-hour TWA of 85 db "]
{"$rows_left_out":102}
{"sheet":"CAPA Tracking","index":3,"n_rows":105,"n_cols":11,"rows_kept":105,"cut":false,"hidden":false,"merged":[[12,1,12,10],[1,1,1,3],[14,7,14,8]]}
[]
[]
[]
[null,null,"Supplier Name:",{"$f":"'Audit Checklist'!C2","v":"Jemison Steel Site Audit"}]
[null,null,"Supplier site (Address):",{"$f":"'Audit Checklist'!C3","v":"1255 North Gate Drive  Sumter, SC 29154"}]
[null,null,"Supplier GUID:",{"$f":"'Audit Checklist'!C4","v":0}]
[null,null,"Audit Date:",{"$f":"'Audit Checklist'!C5","v":"May 2nd 2024"}]
[null,null,"ABB Lead Auditor:",{"$f":"'Audit Checklist'!C6","v":"Henry George"}]
[null,null,"ABB Participants: ",{"$f":"'Audit Checklist'!C7","v":"Shri Mehta,  Roberto Arroya  Jennifer Robison"}]
[null,null,"ABB BA and Division:",{"$f":"'Audit Checklist'!C8","v":0}]
[null,null,"Audit report id:",{"$f":"'Audit Checklist'!C9","v":0}]
[]
[null,"Improvement types:\n• Major – Unacceptable practice or full lack of a critical process , or systemic level deficiency: a process does not exist, not implemented, or violated multiple times. Require CAPA as pre-requisite for vendor approval.\n• Minor – Individual deficiencies: process exists, implemented well, but in one or few cases not followed properly. Require commitment for CAPA with agreed dead line, but it is NOT a pre-requisite for vendor approval\n• Observation – Basic compliance given, but there is room for Improvement. It is NOT a pre-requisite for vendor approval."]
[]
[null,null,null,"Select type to show in the report",null,"To define by supplier"]
{"$rows_left_out":91}
{"sheet":"Evaluation","index":4,"n_rows":37,"n_cols":13,"rows_kept":37,"cut":false,"hidden":false,"merged":[[11,1,19,1],[22,7,22,10],[23,7,23,10],[24,7,24,10],[25,7,25,10],[28,3,29,3],[28,2,29,2],[11,2,12,2],[11,3,12,3],[11,4,11,12],[26,7,26,10]]}
[]
[null,null,"Supplier Name:",{"$f":"'Audit Checklist'!C2","v":"Jemison Steel Site Audit"}]
[null,null,"Supplier site (Address):",{"$f":"'Audit Checklist'!C3","v":"1255 North Gate Drive  Sumter, SC 29154"}]
[null,null,"Supplier GUID:",{"$f":"'Audit Checklist'!C4","v":0}]
[null,null,"Audit Date:",{"$f":"'Audit Checklist'!C5","v":"May 2nd 2024"}]
[null,null,"ABB Lead Auditor:",{"$f":"'Audit Checklist'!C6","v":"Henry George"}]
[null,null,"ABB Participants: ",{"$f":"'Audit Checklist'!C7","v":"Shri Mehta,  Roberto Arroya  Jennifer Robison"}]
[null,null,"ABB BA and Division:",{"$f":"'Audit Checklist'!C8","v":0}]
[null,null,"Audit report id:",{"$f":"'Audit Checklist'!C9","v":0}]
[]
[null,null,0.15,null,0.15,0.15,0.15]
[null,"RESULTS","Audit section","Audit score ","Findings"]
[null,null,null,null,"Show Stopper","Major","Minor","Observation","Meet Req.","Best practice","N/A","Tot","Check"]
[null,null,"Compliance",{"$f":"IFERROR(IF(SUM('Audit Checklist'!E12:E22)/(3*(COUNTA('Audit Checklist'!A12:A22)-COUNTIF('Audit Checklist'!E12:E22,\"NA\")))=0,0,SUM('Audit Checklist'!E12:E22)/(3*(COUNTA('Audit Checklist'!A12:A22)-COUNTIF('Audit Checklist'!E12:E22,\"NA\")))),\"NA\")","v":0.84848484848484851},{"$f":"COUNTIF('Audit Checklist'!$F$12:$F$22,\"ShowStopper\")","v":0},{"$f":"COUNTIF('Audit Checklist'!$F$12:$F$22,\"Major\")","v":0},{"$f":"COUNTIF('Audit Checklist'!$F$12:$F$22,\"Minor\")","v":3},{"$f":"COUNTIF('Audit Checklist'!$F$12:$F$22,\"Observation\")","v":1},{"$f":"COUNTIF('Audit Checklist'!$F$12:$F$22,\"Meet Requirement\")","v":1},{"$f":"COUNTIF('Audit Checklist'!$F$12:$F$22,\"Best practice\")","v":0},{"$f":"COUNTIF('Audit Checklist'!$F$12:$F$22,\"N/A\")","v":0},{"$f":"SUM(E14:K14)","v":5},{"$f":"11-L14","v":6}]
[null,null,"Organizational management",{"$f":"IFERROR(IF(SUM('Audit Checklist'!E26:E29)/(3*(COUNTA('Audit Checklist'!A26:A29)-COUNTIF('Audit Checklist'!E26:E29,\"NA\")))=0,0,SUM('Audit Checklist'!E26:E29)/(3*(COUNTA('Audit Checklist'!A26:A29)-COUNTIF('Audit Checklist'!E26:E29,\"NA\")))),\"NA\")","v":0.83333333333333337},{"$f":"COUNTIF('Audit Checklist'!$F$26:$F$29,\"ShowStopper\")","v":0},{"$f":"COUNTIF('Audit Checklist'!$F$26:$F$29,\"Major\")","v":0},{"$f":"COUNTIF('Audit Checklist'!$F$26:$F$29,\"Minor\")","v":0},{"$f":"COUNTIF('Audit Checklist'!$F$26:$F$29,\"Observation\")","v":1},{"$f":"COUNTIF('Audit Checklist'!$F$26:$F$29,\"Meet Requirement\")","v":0},{"$f":"COUNTIF('Audit Checklist'!$F$26:$F$29,\"Best Practice\")","v":0},{"$f":"COUNTIF('Audit Checklist'!$F$26:$F$29,\"N/A\")","v":0},{"$f":"SUM(E15:K15)","v":1},{"$f":"4-L15","v":3}]
{"$rows_left_out":23}
{"sheet":"List of supportive documents","index":5,"n_rows":52,"n_cols":3,"rows_kept":52,"cut":false,"hidden":false,"merged":[]}
[]
["Section","Question","Supporting Document "]
["Compliance","1.1","Permits and monitoring performed for air emissions, water disposal, and waste disposal. "]
["Compliance",1.2,"Documents of medical surveillance program and metrics (redact any employee names and personal information)"]
["Compliance",1.6,"Permits, if applicable, for local Fire agencies.   Evidence of fire installation maintenance.  Evidence of last fire drills"]
["Compliance","1.10","Provide reports from system used to manage Compliancy of Conflict Minerals / Reach / RoHS & ABB list of restricted and prohibits substances"]
["Compliance","1.11","Material safety data sheets (in local language)."]
[]
["Organization","2.2","Certificates regarding ISO 9.001, ISO 14.001, ISO 45.001 or others management systems"]
["Organization","2.3","Skill matrix by operator, training documents used, and training plan for operators"]
["Organization","2.6","Management meeting reports which includes General Risk Analysis items and actions"]
[]
["Supply Chain","3.1","Internal change management procedure which includes requirement to notify your Customers about changes in process or products.  "]
["Supply Chain","3.2","Evidence of communication to suppliers to require notification of changes in process or products for approval."]
["Supply Chain","3.4","Provide Material Management Flow Chart and example reports of raw material, WIP, and FG inventory, as well as overdues"]
{"$rows_left_out":38}
{"sheet":"Revision Tracking","index":6,"n_rows":12,"n_cols":6,"rows_kept":12,"cut":false,"hidden":false,"merged":[]}
[]
[]
[null,"Revision","Approved by","Date","Revision note","Author"]
[null,1,"Supplier Quality Team","2020-03-18","Score ranges changed, deleted \"yellow area\" from 79% to 60%.","Alessandro Pasinetti"]
[null,2,"Supplier Quality Team","2020-03-26","Added sentence #5.4 ","Alessandro Pasinetti"]
[null,3,"Supplier Quality Team","2020-05-05","Added CAPA Tracking","Attila Tibor"]
[null,4,"Supplier Quality Team","2020-05-28","Adding New and Existing supplier checklist and functions","Attila Tibor"]
[null,5,"Supplier Quality Team","2020-06-16","Added prework tab for new and existing suppliers","Rosaria Veneziano"]
[null,6,"Supplier Quality Team","2020-11-05","Score calculation formula adjusted to be able to handel \"N/A\" sections","Attila Tibor"]
[null,7,"EL Supplier Quality Council","2021-12-01","Full content review and upgrade","Rosaria Veneziano"]
[null,"7.1","EL Supplier Quality Council","2022-01-19","Removed the Portection from the Audit Checklist and made the entire file as read-only","Rosaria Veneziano"]
[null,"2023-07-02","EL Supplier Quality Council","2023-04-18","Bugs fixed","Alessandro Pasinetti / Zsolt Salamon"]