{"text_format":"1","workbook":"xlsx","n_sheets":11,"sheets":["Instructions & Required Docs","Self Assessment","Guide to Completing (CIP)","Cover Page","Contact Info","Standard Summary","Rating Guidlines","Standard Audit Checklist","Cont. Impr. Plan (CIP)","Auditor Guide for Findings","Sheet1"],"not_rendered":{"charts":1,"images":9,"macros":1,"external_links":0,"defined_names":14,"comments":0,"pivot_tables":0},"unopened":[],"bounds":{"document_bytes":16777216,"sheet_cells":100000,"rows_first":2000,"rows_last":500,"rows_between":2000,"halvings":0,"cell_chars":16384,"cell_head_chars":4096},"cells_cut":0,"cells_raw":0,"read":"whole","date_system":"1900"}

{"sheet":"Instructions & Required Docs","index":0,"n_rows":50,"n_cols":3,"rows_kept":50,"cut":false,"hidden":false,"merged":[]}
[]
[]
[]
[]
[]
[null,"Instructions to complete the Self Assessment"]
[]
[null,1,"Complete all Green shaded areas."]
[null,2,"If an area is not applicable, list \"N/A\"."]
[null,3,"Give sufficient detail including listing specification number(s), form number(s) etc…"]
[null,4,"Return at least 1 week prior to the scheduled audit date.(If Applicable)"]
[null,5,"Please send a current copy of the QA Manual at least 1 week prior to the scheduled "]
[null,null,"audit date. (If Applicable)"]
[null,6,"Please assemble below list documents for the day of the visit."]
[]
{"$rows_left_out":36}
{"sheet":"Self Assessment","index":1,"n_rows":474,"n_cols":7,"rows_kept":474,"cut":false,"hidden":false,"merged":[[433,2,433,6],[438,2,438,6],[441,2,441,6],[444,2,444,6],[420,2,420,6],[423,2,423,6],[426,2,426,6],[429,2,429,6],[473,2,473,6],[470,2,470,6],[447,2,447,6],[450,2,450,6],[453,2,453,6],[462,2,462,6],[466,2,466,6],[408,2,408,6],[413,2,413,6],[416,2,416,6],[391,2,391,6],[394,2,394,6],[398,2,398,6],[401,2,401,6],[387,2,387,6],[361,2,361,6],[364,2,364,6],[368,2,368,6],[372,2,372,6],[405,2,405,6],[375,2,375,6],[379,2,379,6],[384,2,384,6],[323,2,323,6],[329,2,329,6],[305,2,305,6],[308,2,308,6],[311,2,311,6],[314,2,314,6],[317,2,317,6],[351,2,351,6],[357,2,357,6],[332,2,332,6],[336,2,336,6],[339,2,339,6],[342,2,342,6],[345,2,345,6],[348,2,348,6],[290,2,290,6],[293,2,293,6],[296,2,296,6],[300,2,300,6],[275,2,275,6],[278,2,278,6],[284,2,284,6],[287,2,287,6],[320,2,320,6],[201,2,201,6],[205,2,205,6],[268,2,268,6],[272,2,272,6],[246,2,246,6],[249,2,249,6],[253,2,253,6],[258,2,258,6],[243,2,243,6],[217,2,217,6],[221,2,221,6],[225,2,225,6],[228,2,228,6],[261,2,261,6],[234,2,234,6],[237,2,237,6],[240,2,240,6],[264,2,264,6],[80,2,80,6],[39,2,39,6],[456,2,456,6],[90,2,90,6],[93,2,93,6],[96,2,96,6],[99,2,99,6],[117,2,117,6],[120,2,120,6],[123,2,123,6],[176,2,176,6],[179,2,179,6],[184,2,184,6],[158,2,158,6],[162,2,162,6],[165,2,165,6],[170,2,170,6],[173,2,173,6],[210,2,210,6],[213,2,213,6],[187,2,187,6],[191,2,191,6],[195,2,195,6],[198,2,198,6],[149,2,149,6],[152,2,152,6],[155,2,155,6],[132,2,132,6],[135,2,135,6],[138,2,138,6],[141,2,141,6],[128,2,128,6],[102,2,102,6],[108,2,108,6],[111,2,111,6],[114,2,114,6],[144,2,144,6]]}
[]
[]
[]
[]
[null,"Basic Information"]
[null,null,"Company Name","Jemison Metals",null,"Date","2023-04-07"]
[null,null,"Division","Cleveland, OH"]
[null,null,"Street Address","8100 Aetna Rd",null,null,"Yes / No"]
[null,null,"City","Cleveland",null,"Manufacturer","yes  "]
[null,null,"State/Province","Ohio",null,"Distributor","no"]
[null,null,"Country","USA",null,"Service","no"]
[null,null,"Postal / Zip Code",44105,null,"Design Responsible","no"]
[null,null,"Email","joates@jemisonmetals.com"]
[null,null,"Phone","216-271-1500"]
[null,null,"Fax","N/A"]
{"$rows_left_out":460}
{"sheet":"Guide to Completing (CIP)","index":2,"n_rows":38,"n_cols":3,"rows_kept":38,"cut":false,"hidden":false,"merged":[]}
[]
[]
[]
[]
[]
[null,"Guidelines to Completing the Continuous Improvement Plan"]
[]
[null,1,"Please complete the form for each item following the example called out in item # 0."]
[null,2,"The intent is for the Continuous Improvement Plan to be a living document. It should be"]
[null,null,"used to document initial responses and then additional information or changes to dates "]
[null,null,"should be made on a regular basis and submitted to Lincoln."]
[null,3,"Please submit your initial response within 30 days of the closing conference call."]
[null,4,"A Lincoln representative will review and accept items that are completed."]
[null,5,"Lincoln may re-audit at some point in the future to validate that actions are effective."]
[null,6,"See below for specific requirements based on the type of nonconformance identified."]
{"$rows_left_out":24}
{"sheet":"Cover Page","index":3,"n_rows":43,"n_cols":13,"rows_kept":43,"cut":false,"hidden":false,"merged":[[3,4,3,5],[4,4,4,5],[23,1,23,2]]}
[]
[null,null,null,null,null,null,null,null,null,null,null,null,"Y"]
[null,null,null,null,null,null,null,null,null,null,null,null,"N"]
[null,null,null,null,"Audit Number",null,null,"CAPAs"]
[null,null,null,null,null,null,1]
[null,"Outstanding","900 + ",null,null,null,2]
[null,"Above Average","750 -  899",null,null,null,3]
[null,"Acceptable","600 -  749",null,null,null,4]
[null,"Needs Improvement","400 -  599",null,null,null,5]
[null,"Not Acceptable","< 400",null,null,null,6]
[null,null,null,null,null,null,7]
[null,"Score - ",{"$f":"'Standard Summary'!I39","v":643.95348837209303}]
[]
[null,"Site Assessment"]
[null,"Supplier Quality Audit"]
{"$rows_left_out":29}
{"sheet":"Contact Info","index":4,"n_rows":39,"n_cols":10,"rows_kept":39,"cut":false,"hidden":false,"merged":[[6,1,6,3],[6,6,6,7],[6,8,6,9],[8,1,8,3],[8,4,8,6],[6,4,6,5],[8,7,8,8]]}
[]
[]
["Site Assessment Supplier Quality Audit"]
[]
[null,"Date:",{"$f":"IF('Cover Page'!B27=\" \",\"not entered\",'Cover Page'!B27)","v":"2023-11-15"}]
[null,"Supplier Name",null,null,"E-mail",null,"Telephone ",null,"Fax"]
[null,{"$f":"IF('Self Assessment'!D6=\"\",\"\",'Self Assessment'!D6)","v":"Jemison Metals"},null,null,{"$f":"IF('Self Assessment'!D13=\"\",\"\",'Self Assessment'!D13)","v":"joates@jemisonmetals.com"},null,{"$f":"IF('Self Assessment'!D14=\"\",\"\",'Self Assessment'!D14)","v":"216-271-1500"},null,{"$f":"IF('Self Assessment'!D15=\"\",\"\",'Self Assessment'!D15)","v":"N/A"}]
[null,"Street Address",null,null,"City ",null,null,"State / Province",null,"Zip Code"]
[null,{"$f":"IF('Self Assessment'!D8=\"\",\"\",'Self Assessment'!D8)","v":"8100 Aetna Rd"},null,null,{"$f":"IF('Self Assessment'!D9=\"\",\"\",'Self Assessment'!D9)","v":"Cleveland"},null,null,{"$f":"IF('Self Assessment'!D10=\"\",\"\",'Self Assessment'!D10)","v":"Ohio"},null,{"$f":"IF('Self Assessment'!D12=\"\",\"\",'Self Assessment'!D12)","v":44105}]
[]
[null,"Title",null,null,null,"Name",null,null,"Phone"]
[]
[null,"President (GM)",null,null,null,{"$f":"IF('Self Assessment'!D19=\"\",\" \",'Self Assessment'!D19)","v":"Craig Mathiason"},null,null,{"$f":"IF('Self Assessment'!G19=\"\",\" \",'Self Assessment'!G19)","v":"336-337-0682"}]
[]
[null,"Chief Operating Officer (COO)",null,null,null,{"$f":"IF('Self Assessment'!D20=\"\",\" \",'Self Assessment'!D20)","v":"Christopher Sweet"},null,null,{"$f":"IF('Self Assessment'!G20=\"\",\" \",'Self Assessment'!G20)","v":"205-413-7266"}]
{"$rows_left_out":25}
{"sheet":"Standard Summary","index":5,"n_rows":41,"n_cols":18,"rows_kept":41,"cut":false,"hidden":false,"merged":[[35,4,35,7],[2,1,2,11]]}
[]
[]
[null,"  Supplier Results Summary"]
[]
[null,null,"Subject to the recommendation and supplier commitments herein, the quality system  "]
[null,null,"has been found to be:"]
[]
[null,null,{"$f":"I39","v":643.95348837209303},"  Outstanding   (900 + )"]
[]
[null,null,{"$f":"I39","v":643.95348837209303},"  Above Average (750-899)"]
[]
[null,null,{"$f":"I39","v":643.95348837209303},"  Acceptable (600-749)"]
[]
[null,null,{"$f":"I39","v":643.95348837209303},"  Needs Improvement (400-599)"]
[]
{"$rows_left_out":27}
{"sheet":"Rating Guidlines","index":6,"n_rows":31,"n_cols":12,"rows_kept":31,"cut":false,"hidden":false,"merged":[[29,8,29,11],[30,8,30,11],[28,8,28,11],[1,1,1,12],[13,3,13,5],[13,7,13,9],[13,11,13,12],[15,3,15,5],[25,8,25,11],[26,8,26,11],[27,8,27,11],[23,11,23,12],[15,11,15,12],[17,3,17,5],[17,7,17,9],[23,7,23,9],[15,7,15,9],[23,3,23,5],[19,3,19,5],[25,5,25,7],[17,11,17,12],[19,11,19,12],[21,11,21,12],[19,7,19,9],[21,3,21,5],[21,7,21,9]]}
[]
[]
[null,"Instruction for Auditor application of rating"]
[null,1,null,"No system in place will be rated as a 1"]
[null,2,null,"Systems that are in place but need improvement will be rated as a 2"]
[null,3,null,"Most areas that comply with no issues will be rated as a 3"]
[null,4,null,"Above average areas will be rated as a 4 "]
[null,5,null,"Exceptional areas will be rated as a 5 (world class level - 90th percentile)"]
[null,6,null,"N/A should only be used when an area is not applicable such as the In-Process"]
[null,null,null,"section for a supplier that is a distributor and does not have any manufacturing."]
[]
[null,null,null,null,"Supplier Quality Audit"]
[]
[null,"Rating Value",null,"System",null,null,null,"Implementation",null,null,null,"General Result"]
[]
{"$rows_left_out":17}
{"sheet":"Standard Audit Checklist","index":7,"n_rows":129,"n_cols":21,"rows_kept":129,"cut":false,"hidden":false,"merged":[[129,1,140,7],[128,1,128,7]]}
[]
[null,"Item","Description","Supplier Comment","Value: 1,2,3,4,5 ","Total Value","Observation","Continuous Improvement",null,null,null,null,null,null,"Rating",1,2,3,4,5,"N/A"]
[null,1,"CONTRACT REVIEW & ORDER ENTRY",null,null,null,null,null,null,null,null,null,5,null,"Number of Scores",{"$f":"COUNTIF($O$4:$O$121,\"=1\")","v":0},{"$f":"COUNTIF($O$4:$O$121,\"=2\")","v":2},{"$f":"COUNTIF($O$4:$O$121,\"=3\")","v":77},{"$f":"COUNTIF($O$4:$O$121,\"=4\")","v":6},{"$f":"COUNTIF($O$4:$O$121,\"=5\")","v":1},{"$f":"COUNTIF($O$4:$O$121,\"=N/A\")","v":4}]
[null,"1a.","Who reviews purchase orders? Do they have the technical background to ensure that Lincoln requirements are met? ",{"$f":"CONCATENATE('Self Assessment'!C86,\",\",'Self Assessment'!C87,\" ,\",'Self Assessment'!C88,\".\",'Self Assessment'!C91)","v":"Sales associate,Territory Manager ,.All Jemison sales associates, and Territory Manger have the technical background for any material or items Jemison supplies. For more complicated grades Jemison has a Metallurgist  on staff.  "},3,{"$f":"IF(E4=\"N/A\",0,5)","v":5},"All PO's reviewed by sales with a formal quality review done for every part spec.",null,null,null,null,null,4,null,{"$f":"E4","v":3}]
[null,"1b.","Are Lincoln requirements reviewed to ensure that they can be met? ",null,3,5,"Specs are reviewed in a multi-stage process upon contracting of work. Specs are reviewed and entered long before PO arrives.             -PO's are not resent if changes are made from Lincoln's side.",null,null,null,null,null,3,null,3]
[null,"1c.","Are Lincoln revisions documented through-out the system to ensure that product is made to current revisions?  ",null,2,5,"All revisions are treated as new parts and reviewed for any potential effect on working process. Although upon review a Lincoln PO had listed revision Z, but the Jemison work order had listed revision Y.","OFI",null,null,null,null,2,null,2]
[null,"1d.","Is proper acceptance of deviation of plant, materials, processes etc... gained from Lincoln prior to production? Are records of this activity kept?   ",{"$f":"CONCATENATE('Self Assessment'!C94,\". \",'Self Assessment'!C97)","v":"Lincoln will be sent a deviation request. Form available to review.. Yes. They are saved in a customer file. "},3,5,"Customer deviation form given to customer, it must be accepted in order to ship. Typical deviations come from steel mill and is usually rejected for good material.",null,null,null,null,null,1,null,3]
[null,"1e.","Is there a process to notify Lincoln if delivery will not meet Lincolns documented delivery date? Is this tracked and actions taken to improve?",{"$f":"'Self Assessment'!C100","v":"Sales associates will notify Lincoln if a delivery date cannot be met.  "},3,5,"Inside sales person notifies Lincoln if due dates won't be met. Shipping delays also communicated from inside sales rep (Sarah).",null,null,null,null,null,"N/A",null,3]
[null,"1f.","Is on-time delivery tracked to your customer(s)? Are actions documented to improve performance of this metric?                                            ",{"$f":"'Self Assessment'!C103","v":"Yes, as part of monthly KPI. "},4,5,"Tracked monthly by facility with 99.1% on time deliveries for Cleveland facility. Deliveries also tracked and reviewed weekly. ",null,null,null,null,null,null,null,4]
[null,null,{"$f":"CONCATENATE(\"Rating \",E10,\",  Possible \",F10,\" points.\")","v":"Rating 18,  Possible 30 points."},null,{"$f":"SUM(E4:E9)","v":18},{"$f":"SUM(F4:F9)","v":30}]
[null,2,"RECEIVING"]
[null,"2a.","Is there a sampling plan for incoming inspection? Are Certificate of Analysis received and filed? Is risk of product failure considered in determining a sample plan?",{"$f":"'Self Assessment'!C109","v":"Jemison receives only raw material in coil form. All coils are inspected for damage and certs are saved and entered into our inventory system. Mill paperwork and coil identification is checked against the PO Jemison issued. "},3,{"$f":"IF(E12=\"N/A\",0,5)","v":5},"Inspection is done in-process once steel coil is on the line.",null,null,null,null,null,null,null,{"$f":"E12","v":3}]
[null,"2b.","How does the supplier ensure materials are fit for use?   ",{"$f":"'Self Assessment'!C112","v":"Jemison does not ensure fitness for use. Jemison purchases to customer requirements from the mill, then processes the material into the final finished goods size based on customer requirements. "},3,5,"Jemison purchases to Lincoln requirements from steel mill. Only ensures final product is fit for use.",null,null,null,null,null,null,null,3]
[null,"2c.","Are raw materials identified and traced to test or certification? ",{"$f":"'Self Assessment'!C115","v":"Yes. All certs are checked to make sure they match the incoming material by identification number. "},3,5,"Certifications tracked and receiving papers signed by receiver. Product is then labeled and tagged.",null,null,null,null,null,null,null,3]
[null,"2d.","Is all incoming material identified to prevent mixing and misuse of defective stock and maintain lot control where required?   ",{"$f":"'Self Assessment'!C118","v":"Yes. All are identified by a specific ID number and are traceable throughout all processing and shipment. "},3,5,"Incoming material log tracks all received items location, condition, and specs. All steel coils are labeled and segregated in rows by grade.",null,null,null,null,null,null,null,3]
{"$rows_left_out":115}
{"sheet":"Cont. Impr. Plan (CIP)","index":8,"n_rows":25,"n_cols":10,"rows_kept":25,"cut":false,"hidden":false,"merged":[[0,2,0,9],[2,1,2,9],[3,1,4,5],[3,6,4,8],[5,1,6,9]]}
[null,null,"CONTINUOUS IMPROVEMENT PLAN"]
[]
[null,"Supplier Quality Action Planning"]
[null,"Supplier Name:   ",null,null,null,null,"Date: "]
[]
[null,"Personnel Assigned to Matrix:"]
[]
[]
[]
[null,"Supplier Quality Action Plan"]
[null,"No.","Action items","MAJOR/ MINOR/ OFI","Supplier Internal CAPA #","Individuals Responsible","Date Initiated","Target Date","Actual Comp.","Comments                                                                  (Include Objective Quality Evidence Provided)"]
[null,null,"EXAMPLE"]
[null,0,"It was found that there is no form number or revision on the final test sheet.","Minor",101,"John Smith","2010-01-01","2010-01-30","2010-01-15","Form number F-123 Revision 1/14/2010 was redesigned and put into use in the final inspection area. Internal specification SPEC-456 was updated to reference this new form number. Copy of the form and specification are attached."]
[null,1,"1C: Upon review a Lincoln PO 12226508, had listed revision Z for RMB-53-100, but the Jemison work order had listed revision Y. Jemison shall alert Lincoln immediately if specifications listed on purchase orders do not match internal records at the time of initial review.","OFI"]
[null,2,"9D: PPE such as hearing protection, hard hats, and cutproof gloves are not required around the production area. Additionally, a crane was left unattended in the loaded and lifted position in the middle of an aisle, posing a potential safety risk.","OFI"]
{"$rows_left_out":11}
{"sheet":"Auditor Guide for Findings","index":9,"n_rows":44,"n_cols":4,"rows_kept":44,"cut":false,"hidden":false,"merged":[]}
[]
[]
[]
[]
[]
[null,"Guidelines to Categorizing Nonconformances"]
[]
[null,null,"Major Nonconformance (Major)"]
[null,1,"Evidence of the absence or total breakdown of a system to meet quality system requirements."]
[null,null,null,"Example: No internal audit system is implemented."]
[null,2,"Multiple minor nonconformities found against one requirement."]
[null,null,null,"Example: No revision control on specifications, records and forms."]
[null,3,"Any nonconformity that would result in the probable shipment of nonconforming product or"]
[null,null,"result in the failure or usability of the product for the intended purpose."]
[null,null,null,"Example: Incorrect customer requirements stated on internal specifications used for"]
{"$rows_left_out":30}
{"sheet":"Sheet1","index":10,"n_rows":94,"n_cols":4,"rows_kept":94,"cut":false,"hidden":false,"merged":[]}
["Sales associate,Territory Manager ,.All Jemison sales associates, and Territory Manger have the technical background for any material or items Jemison supplies. For more complicated grades Jemison has a Metallurgist  on staff.  ",3,5,"All PO's reviewed by sales with a formal quality review done for every part spec."]
[null,3,5,"Specs are reviewed in a multi-stage process upon contracting of work. Specs are reviewed and entered long before PO arrives.             -PO's are not resent if changes are made from Lincoln's side."]
[null,2,5,"All revisions are treated as new parts and reviewed for any potential effect on working process. Although upon review a Lincoln PO had listed revision Z, but the Jemison work order had listed revision Y."]
["Lincoln will be sent a deviation request. Form available to review.. Yes. They are saved in a customer file. ",3,5,"Customer deviation form given to customer, it must be accepted in order to ship. Typical deviations come from steel mill and is usually rejected for good material."]
["Sales associates will notify Lincoln if a delivery date cannot be met.  ",3,5,"Inside sales person notifies Lincoln if due dates won't be met. Shipping delays also communicated from inside sales rep (Sarah)."]
["Yes, as part of monthly KPI. ",4,5,"Tracked monthly by facility with 99.1% on time deliveries for Cleveland facility. Deliveries also tracked and reviewed weekly. "]
["Jemison receives only raw material in coil form. All coils are inspected for damage and certs are saved and entered into our inventory system. Mill paperwork and coil identification is checked against the PO Jemison issued. ",3,5,"Inspection is done in-process once steel coil is on the line."]
["Jemison does not ensure fitness for use. Jemison purchases to customer requirements from the mill, then processes the material into the final finished goods size based on customer requirements. ",3,5,"Jemison purchases to Lincoln requirements from steel mill. Only ensures final product is fit for use."]
["Yes. All certs are checked to make sure they match the incoming material by identification number. ",3,5,"Certifications tracked and receiving papers signed by receiver. Product is then labeled and tagged."]
["Yes. All are identified by a specific ID number and are traceable throughout all processing and shipment. ",3,5,"Incoming material log tracks all received items location, condition, and specs. All steel coils are labeled and segregated in rows by grade."]
["A receiving procedure is in place. ",3,5,"Instructions available digitally via intranet on receiving dock computer."]
["Receiving records are attached virtually to the coil and are available as part of the traceability. All suppliers are graded per specific measurable and these grades are supplied and reviewed quarterly with the supplier. ",3,5,"Incoming records signed by receiver and sent to front office. Records then retained digitally for traceability."]
["Operation procedure, Work instructions.",3,5,"Instructions available both physically and digitally at each work station. Physical copies examined at observed workstation matched with digital copies available on intranet."]
["Jemison has a \"Rev up\" document and procedure. Available to review during audit.. Jemison has a \"Rev up\" document and procedure. That requires a sign off. Available to review during audit.",3,5,"Rev-up procedure followed to update requirements. Physical work form is always checked against digital copy before processing. If there is a discrepancy physical is reviewed with office."]
["Procedure calls out steps to be taken to identify product on each run. Each run will have individual work instructions that identify material to be used. ",3,5,"Steel coils ran one at a time until completion before moving on to next job. Each coil is purchased to job size prior to processing."]
{"$rows_left_out":79}