{"text_format":"1","workbook":"xlsx","n_sheets":6,"sheets":["Deckblatt_Cover","Checkliste","Maßnahmenplan_Actionplan","Ausgabe_Output","Read me","Tabelle1"],"not_rendered":{"charts":1,"images":15,"macros":1,"external_links":0,"defined_names":68,"comments":0,"pivot_tables":0},"unopened":[],"bounds":{"document_bytes":16777216,"sheet_cells":100000,"rows_first":2000,"rows_last":500,"rows_between":2000,"halvings":0,"cell_chars":16384,"cell_head_chars":4096},"cells_cut":0,"cells_raw":0,"read":"whole","date_system":"1900"}

{"sheet":"Deckblatt_Cover","index":0,"n_rows":28,"n_cols":20,"rows_kept":28,"cut":false,"hidden":false,"merged":[[29,1,29,3],[31,0,31,1],[26,0,26,1],[27,0,27,1],[27,8,27,11],[26,8,26,11],[26,5,26,7],[26,2,26,4],[27,5,27,7],[27,2,27,4],[1,0,1,11],[3,4,3,5],[3,6,3,7],[25,2,25,4],[24,2,24,4],[24,0,24,1],[5,4,5,6],[25,0,25,1],[25,5,25,10],[24,5,24,10]]}
[null,null,null,null,null,null,null,null,null,null,null,null,null,null,null,2]
[{"$f":"IF(P1=1,\"Auditprotokoll\",\"Audit Protocol\")","v":"Audit Protocol"},null,null,null,null,null,null,null,null,null,null,null,"Auswahl / Selection"]
[]
[null,null,null,null,{"$f":"Checkliste!A275","v":"Overall result:"},null,{"$f":"Checkliste!F275","v":0.92222222222222228}]
[]
[]
{"$rows_left_out":23}
{"sheet":"Checkliste","index":1,"n_rows":279,"n_cols":25,"rows_kept":279,"cut":false,"hidden":false,"merged":[[104,13,106,14],[7,1,7,12],[88,1,88,12],[130,1,130,12],[153,1,153,12],[216,1,216,12],[8,1,8,12],[50,1,50,12],[69,1,69,12],[78,1,78,12],[89,1,89,12],[117,1,117,12],[131,1,131,12],[145,1,145,12],[161,1,161,12],[154,1,154,12],[14,2,14,4],[15,2,15,4],[16,2,16,4],[17,2,17,4],[18,2,18,4],[19,2,19,4],[103,2,103,4],[99,2,99,4],[104,1,104,12],[93,2,93,4],[92,2,92,4],[87,2,87,4],[91,2,91,4],[23,1,23,12],[106,0,116,0],[39,0,49,0],[25,0,36,0],[36,2,36,4],[36,5,36,12],[100,2,100,4],[101,2,101,4],[102,2,102,4],[107,2,107,4],[108,2,108,4],[109,2,109,4],[97,2,97,4],[96,2,96,4],[70,5,70,12],[79,5,79,12],[54,5,54,12],[33,2,33,4],[35,2,35,4],[158,2,158,4],[168,2,168,4],[201,2,201,4],[136,2,136,4],[137,2,137,4],[138,2,138,4],[139,2,139,4],[140,2,140,4],[147,2,147,4],[156,2,156,4],[143,2,143,4],[179,1,179,12],[175,2,175,4],[176,2,176,4],[182,2,182,4],[183,2,183,4],[184,2,184,4],[185,2,185,4],[157,2,157,4],[150,2,150,4],[151,2,151,4],[164,2,164,4],[165,2,165,4],[166,2,166,4],[37,13,39,14],[38,5,38,12],[39,2,39,4],[209,2,209,4],[208,2,208,4],[52,2,52,4],[58,2,58,4],[65,2,65,4],[71,2,71,4],[80,2,80,4],[60,2,60,4],[61,2,61,4],[62,2,62,4],[66,2,66,4],[67,2,67,4],[72,2,72,4],[73,2,73,4],[74,2,74,4],[159,2,159,4],[205,2,205,4],[186,2,186,4],[204,2,204,4],[187,2,187,4],[158,5,158,12],[245,2,245,4],[251,2,251,4],[252,2,252,4],[177,2,177,4],[167,2,167,4],[163,2,163,4],[173,2,173,4],[174,2,174,4],[148,2,148,4],[149,2,149,4],[192,2,192,4],[193,2,193,4],[194,2,194,4],[197,1,197,12],[219,2,219,4],[195,2,195,4],[204,5,204,12],[187,5,187,12],[205,5,205,12],[213,5,213,12],[214,5,214,12],[220,5,220,12],[215,5,215,12],[178,5,178,12],[240,2,240,4],[221,2,221,4],[223,2,223,4],[228,2,228,4],[223,5,223,12],[224,5,224,12],[231,2,231,4],[235,2,235,4],[222,5,222,12],[232,5,232,12],[226,2,226,4],[228,5,228,12],[230,5,230,12],[227,5,227,12],[232,2,232,4],[229,2,229,4],[230,2,230,4],[263,2,263,4],[258,2,258,4],[254,2,254,4],[274,0,274,3],[272,0,272,3],[271,0,271,3],[270,0,270,3],[269,0,269,3],[268,0,268,3],[258,0,264,0],[250,0,255,0],[256,1,256,12],[253,2,253,4],[250,2,250,4],[262,5,262,12],[272,5,272,6],[271,5,271,6],[268,5,268,6],[267,5,267,6],[262,2,262,4],[260,2,260,4],[261,2,261,4],[263,5,263,12],[259,5,259,12],[253,5,253,12],[268,7,268,12],[269,7,269,12],[135,2,135,4],[170,1,170,12],[217,1,217,12],[238,1,238,12],[155,5,155,12],[184,5,184,12],[162,5,162,12],[171,5,171,12],[165,5,165,12],[160,5,160,12],[168,5,168,12],[169,5,169,12],[157,5,157,12],[164,5,164,12],[141,2,141,4],[182,5,182,12],[183,5,183,12],[151,5,151,12],[152,5,152,12],[172,2,172,4],[181,2,181,4],[7,15,14,15],[7,16,11,16],[45,5,45,12],[46,5,46,12],[47,5,47,12],[48,5,48,12],[35,5,35,12],[32,2,32,4],[22,5,22,12],[11,5,11,12],[12,5,12,12],[13,5,13,12],[14,5,14,12],[40,5,40,12],[44,5,44,12],[21,2,21,4],[10,2,10,4],[31,2,31,4],[11,2,11,4],[12,2,12,4],[13,2,13,4],[22,2,22,4],[40,2,40,4],[27,2,27,4],[28,2,28,4],[29,2,29,4],[278,4,278,5],[265,0,265,12],[245,5,245,12],[251,5,251,12],[278,1,278,2],[277,1,277,2],[277,4,277,5],[277,9,277,10],[277,11,277,12],[278,11,278,12],[278,9,278,10],[278,6,278,8],[277,6,277,8],[276,1,276,2],[276,9,276,10],[276,11,276,12],[276,4,276,5],[272,7,272,12],[266,0,266,12],[259,2,259,4],[257,5,257,12],[276,6,276,8],[273,5,273,6],[274,5,274,6],[20,2,20,4],[270,5,270,6],[269,5,269,6],[49,2,49,4],[201,5,201,12],[239,5,239,12],[185,5,185,12],[159,5,159,12],[49,5,49,12],[56,5,56,12],[51,5,51,12],[55,5,55,12],[61,5,61,12],[62,5,62,12],[82,5,82,12],[53,5,53,12],[90,5,90,12],[84,2,84,4],[85,2,85,4],[86,2,86,4],[83,5,83,12],[101,5,101,12],[110,5,110,12],[111,5,111,12],[84,5,84,12],[85,5,85,12],[86,5,86,12],[270,7,270,12],[271,7,271,12],[254,5,254,12],[249,5,249,12],[255,5,255,12],[261,5,261,12],[264,5,264,12],[260,5,260,12],[246,5,246,12],[125,5,125,12],[126,5,126,12],[127,5,127,12],[134,5,134,12],[150,5,150,12],[148,5,148,12],[149,5,149,12],[141,5,141,12],[142,5,142,12],[118,5,118,12],[94,2,94,4],[87,5,87,12],[76,5,76,12],[81,5,81,12],[93,5,93,12],[95,5,95,12],[66,5,66,12],[112,5,112,12],[113,5,113,12],[67,5,67,12],[72,5,72,12],[73,5,73,12],[74,5,74,12],[75,5,75,12],[102,5,102,12],[97,5,97,12],[103,5,103,12],[94,5,94,12],[77,5,77,12],[107,5,107,12],[108,5,108,12],[109,5,109,12],[96,5,96,12],[100,5,100,12],[6,5,6,12],[137,5,137,12],[138,5,138,12],[139,5,139,12],[140,5,140,12],[41,2,41,4],[42,2,42,4],[56,2,56,4],[63,2,63,4],[68,2,68,4],[43,2,43,4],[37,1,37,12],[95,2,95,4],[59,5,59,12],[60,5,60,12],[92,5,92,12],[75,2,75,4],[76,2,76,4],[81,2,81,4],[63,5,63,12],[68,5,68,12],[82,2,82,4],[83,2,83,4],[6,1,6,4],[9,5,9,12],[24,5,24,12],[41,5,41,12],[42,5,42,12],[43,5,43,12],[15,5,15,12],[16,5,16,12],[17,5,17,12],[18,5,18,12],[19,5,19,12],[20,5,20,12],[21,5,21,12],[26,5,26,12],[27,5,27,12],[28,5,28,12],[29,5,29,12],[32,5,32,12],[33,5,33,12],[34,5,34,12],[25,2,25,4],[34,2,34,4],[26,2,26,4],[240,0,247,0],[200,5,200,12],[202,5,202,12],[203,5,203,12],[212,5,212,12],[231,5,231,12],[233,5,233,12],[247,5,247,12],[242,2,242,4],[243,2,243,4],[244,2,244,4],[241,2,241,4],[227,2,227,4],[213,2,213,4],[214,2,214,4],[220,2,220,4],[222,2,222,4],[246,2,246,4],[200,2,200,4],[202,2,202,4],[203,2,203,4],[156,0,160,0],[172,0,178,0],[181,0,196,0],[199,0,215,0],[219,0,237,0],[206,5,206,12],[210,5,210,12],[186,5,186,12],[166,5,166,12],[167,5,167,12],[173,5,173,12],[174,5,174,12],[175,5,175,12],[176,5,176,12],[180,5,180,12],[221,5,221,12],[191,5,191,12],[163,0,169,0],[195,5,195,12],[198,5,198,12],[229,5,229,12],[193,5,193,12],[194,5,194,12],[191,2,191,4],[126,2,126,4],[127,2,127,4],[134,2,134,4],[129,2,129,4],[119,2,119,4],[190,2,190,4],[199,2,199,4],[125,2,125,4],[69,13,71,14],[78,13,80,14],[129,5,129,12],[144,2,144,4],[142,2,142,4],[120,2,120,4],[116,2,116,4],[133,2,133,4],[114,2,114,4],[122,5,122,12],[114,5,114,12],[115,5,115,12],[116,5,116,12],[146,5,146,12],[120,5,120,12],[121,5,121,12],[256,13,258,14],[248,13,250,14],[238,13,240,14],[197,13,199,14],[216,13,219,14],[170,13,172,14],[123,5,123,12],[124,5,124,12],[241,5,241,12],[211,5,211,12],[252,5,252,12],[136,5,136,12],[132,5,132,12],[135,5,135,12],[177,5,177,12],[188,5,188,12],[196,5,196,12],[218,5,218,12],[209,5,209,12],[192,5,192,12],[248,1,248,12],[242,5,242,12],[243,5,243,12],[244,5,244,12],[210,2,210,4],[211,2,211,4],[212,2,212,4],[236,2,236,4],[236,5,236,12],[237,5,237,12],[10,0,22,0],[52,0,68,0],[71,0,77,0],[80,0,87,0],[91,0,103,0],[119,0,129,0],[133,0,144,0],[55,2,55,4],[59,2,59,4],[47,2,47,4],[48,2,48,4],[53,2,53,4],[54,2,54,4],[110,2,110,4],[111,2,111,4],[112,2,112,4],[113,2,113,4],[115,2,115,4],[1,0,1,11],[179,13,181,14],[153,13,156,14],[130,13,133,14],[88,13,91,14],[117,13,119,14],[145,13,147,14],[161,13,163,14],[8,13,10,14],[23,13,25,14],[50,13,52,14],[44,2,44,4],[45,2,45,4],[46,2,46,4],[147,0,152,0],[143,5,143,12],[144,5,144,12],[106,2,106,4],[128,2,128,4],[128,5,128,12],[121,2,121,4],[122,2,122,4],[123,2,123,4],[124,2,124,4]]}
[null,null,null,null,null,null,null,null,null,null,null,null,null,null,null,null,null,null,null,{"$f":"IF(U1=1,\"nicht bewertet\",\"not assessed\")","v":"not assessed"},{"$f":"Deckblatt_Cover!P1","v":2}]
[{"$f":"IF(U1=1,CONCATENATE(\"Lieferantenaudit  Fa. \",Deckblatt_Cover!C26),CONCATENATE(\"Supplier Audit Company \",Deckblatt_Cover!C26))","v":"Supplier Audit Company Jemison Metals"},null,null,null,null,null,null,null,null,null,null,null,null,null,null,null,null,0,"x",0]
[null,null,null,null,null,null,null,null,null,null,null,null,null,null,null,null,null,2,null,2]
[null,null,null,{"$f":"IF(U1=1,\"Erst - Audit:\",\"Initial audit:\")","v":"Initial audit:"},null,null,null,null,{"$f":"IF(U1=1,\"Folge - Audit:\",\"follow up audit:\")","v":"follow up audit:"},null,null,null,null,null,null,null,null,4,null,4]
[null,null,null,null,null,null,null,null,null,null,null,null,null,null,null,null,null,6,null,6]
[null,null,null,null,null,null,null,null,null,null,null,null,null,null,null,null,null,8,null,8]
{"$rows_left_out":274}
{"sheet":"Maßnahmenplan_Actionplan","index":2,"n_rows":162,"n_cols":61,"rows_kept":162,"cut":false,"hidden":false,"merged":[[153,47,153,51],[158,47,158,51],[108,47,108,51],[113,47,113,51],[118,47,118,51],[123,47,123,51],[128,47,128,51],[133,47,133,51],[138,47,138,51],[143,47,143,51],[148,47,148,51],[131,2,131,51],[132,2,132,51],[136,2,136,51],[137,2,137,51],[129,2,129,30],[129,31,129,36],[129,37,129,41],[129,42,129,46],[129,47,129,51],[139,2,139,30],[139,31,139,36],[139,37,139,41],[139,42,139,46],[63,47,63,51],[68,47,68,51],[73,47,73,51],[78,47,78,51],[83,47,83,51],[88,47,88,51],[93,47,93,51],[98,47,98,51],[103,47,103,51],[102,2,102,51],[63,42,63,46],[68,42,68,46],[78,42,78,46],[64,2,64,30],[64,31,64,36],[64,37,64,41],[64,42,64,46],[64,47,64,51],[74,2,74,30],[74,31,74,36],[74,37,74,41],[74,42,74,46],[74,47,74,51],[72,2,72,51],[41,0,44,1],[46,0,49,1],[51,0,54,1],[19,37,19,41],[13,47,13,51],[18,47,18,51],[23,47,23,51],[28,47,28,51],[33,47,33,51],[38,47,38,51],[43,47,43,51],[48,47,48,51],[53,47,53,51],[46,2,46,51],[47,2,47,51],[34,2,34,30],[34,31,34,36],[34,37,34,41],[34,42,34,46],[34,47,34,51],[43,31,43,36],[48,31,48,36],[41,2,41,51],[42,2,42,51],[101,0,104,1],[106,0,109,1],[111,0,114,1],[116,0,119,1],[121,0,124,1],[126,0,129,1],[131,0,134,1],[136,0,139,1],[56,0,59,1],[61,0,64,1],[66,0,69,1],[71,0,74,1],[76,0,79,1],[81,0,84,1],[86,0,89,1],[91,0,94,1],[96,0,99,1],[146,0,149,1],[151,0,154,1],[156,0,159,1],[6,40,6,44],[141,0,144,1],[26,2,26,51],[27,2,27,51],[14,2,14,30],[14,31,14,36],[14,37,14,41],[14,42,14,46],[14,47,14,51],[17,2,17,51],[11,0,14,1],[16,0,19,1],[21,0,24,1],[26,0,29,1],[24,2,24,30],[24,31,24,36],[24,37,24,41],[24,42,24,46],[24,47,24,51],[19,2,19,30],[19,31,19,36],[59,2,59,30],[59,31,59,36],[59,37,59,41],[59,42,59,46],[59,47,59,51],[54,2,54,30],[54,31,54,36],[54,37,54,41],[54,42,54,46],[54,47,54,51],[56,2,56,51],[57,2,57,51],[58,37,58,41],[55,2,55,51],[58,2,58,30],[58,47,58,51],[58,42,58,46],[58,31,58,36],[69,31,69,36],[69,37,69,41],[69,42,69,46],[69,47,69,51],[73,42,73,46],[84,42,84,46],[84,47,84,51],[81,2,81,51],[82,2,82,51],[78,37,78,41],[73,37,73,41],[73,2,73,30],[107,2,107,51],[105,2,105,51],[103,31,103,36],[103,42,103,46],[99,2,99,30],[99,31,99,36],[99,37,99,41],[99,42,99,46],[99,47,99,51],[100,2,100,51],[119,2,119,30],[119,31,119,36],[119,37,119,41],[119,42,119,46],[119,47,119,51],[114,2,114,30],[114,31,114,36],[114,37,114,41],[114,42,114,46],[114,47,114,51],[115,2,115,51],[118,2,118,30],[116,2,116,51],[117,2,117,51],[118,37,118,41],[118,31,118,36],[124,2,124,30],[124,31,124,36],[124,37,124,41],[124,42,124,46],[124,47,124,51],[121,2,121,51],[122,2,122,51],[126,2,126,51],[127,2,127,51],[123,37,123,41],[123,31,123,36],[134,37,134,41],[134,42,134,46],[134,47,134,51],[149,37,149,41],[149,42,149,46],[149,47,149,51],[144,2,144,30],[144,31,144,36],[144,37,144,41],[144,42,144,46],[144,47,144,51],[141,2,141,51],[142,2,142,51],[146,2,146,51],[147,2,147,51],[159,2,159,30],[159,31,159,36],[159,37,159,41],[159,42,159,46],[159,47,159,51],[154,2,154,30],[154,31,154,36],[154,37,154,41],[154,42,154,46],[154,47,154,51],[156,2,156,51],[157,2,157,51],[1,2,1,49],[3,2,3,49],[4,2,4,49],[6,6,6,26],[8,6,8,49],[51,2,51,51],[52,2,52,51],[49,2,49,30],[49,31,49,36],[49,37,49,41],[49,42,49,46],[49,47,49,51],[11,2,11,51],[12,2,12,51],[16,2,16,51],[44,2,44,30],[44,31,44,36],[44,37,44,41],[44,42,44,46],[44,47,44,51],[39,2,39,30],[39,31,39,36],[45,2,45,51],[6,45,6,48],[2,0,2,51],[31,0,34,1],[36,0,39,1],[19,47,19,51],[21,2,21,51],[22,2,22,51],[29,2,29,30],[23,31,23,36],[28,31,28,36],[33,31,33,36],[38,31,38,36],[13,31,13,36],[18,31,18,36],[31,2,31,51],[32,2,32,51],[36,2,36,51],[37,2,37,51],[39,37,39,41],[39,42,39,46],[39,47,39,51],[19,42,19,46],[6,1,6,5],[108,31,108,36],[68,37,68,41],[88,42,88,46],[93,42,93,46],[98,42,98,46],[8,1,8,5],[10,2,10,51],[15,2,15,51],[20,2,20,51],[25,2,25,51],[30,2,30,51],[35,2,35,51],[40,2,40,51],[13,37,13,41],[28,42,28,46],[23,42,23,46],[18,42,18,46],[13,42,13,46],[33,42,33,46],[38,42,38,46],[18,2,18,30],[13,2,13,30],[98,2,98,30],[106,2,106,51],[68,2,68,30],[70,2,70,51],[75,2,75,51],[80,2,80,51],[85,2,85,51],[90,2,90,51],[95,2,95,51],[96,2,96,51],[97,2,97,51],[94,2,94,30],[94,31,94,36],[94,37,94,41],[94,42,94,46],[94,47,94,51],[91,2,91,51],[92,2,92,51],[83,37,83,41],[76,2,76,51],[77,2,77,51],[93,2,93,30],[88,2,88,30],[83,2,83,30],[78,2,78,30],[69,2,69,30],[98,31,98,36],[86,2,86,51],[87,2,87,51],[79,2,79,30],[79,31,79,36],[79,37,79,41],[79,42,79,46],[79,47,79,51],[83,42,83,46],[63,31,63,36],[68,31,68,36],[73,31,73,36],[78,31,78,36],[83,31,83,36],[88,31,88,36],[93,31,93,36],[60,2,60,51],[65,2,65,51],[63,2,63,30],[63,37,63,41],[61,2,61,51],[62,2,62,51],[66,2,66,51],[67,2,67,51],[71,2,71,51],[89,2,89,30],[89,31,89,36],[89,37,89,41],[89,42,89,46],[89,47,89,51],[84,2,84,30],[84,31,84,36],[84,37,84,41],[128,31,128,36],[133,31,133,36],[138,31,138,36],[143,31,143,36],[148,31,148,36],[120,2,120,51],[125,2,125,51],[130,2,130,51],[135,2,135,51],[140,2,140,51],[145,2,145,51],[148,2,148,30],[143,2,143,30],[138,2,138,30],[133,2,133,30],[128,2,128,30],[123,2,123,30],[148,37,148,41],[143,37,143,41],[138,37,138,41],[128,37,128,41],[139,47,139,51],[134,2,134,30],[134,31,134,36],[113,37,113,41],[108,37,108,41],[103,37,103,41],[98,37,98,41],[93,37,93,41],[88,37,88,41],[111,2,111,51],[112,2,112,51],[109,2,109,30],[109,31,109,36],[109,37,109,41],[109,42,109,46],[109,47,109,51],[110,2,110,51],[113,2,113,30],[104,2,104,30],[104,31,104,36],[104,37,104,41],[104,42,104,46],[104,47,104,51],[101,2,101,51],[113,31,113,36],[108,2,108,30],[103,2,103,30],[53,37,53,41],[48,37,48,41],[43,37,43,41],[38,37,38,41],[33,37,33,41],[28,37,28,41],[23,37,23,41],[18,37,18,41],[50,2,50,51],[53,2,53,30],[29,42,29,46],[29,47,29,51],[43,42,43,46],[48,42,48,46],[53,42,53,46],[53,31,53,36],[48,2,48,30],[43,2,43,30],[29,31,29,36],[29,37,29,41],[38,2,38,30],[33,2,33,30],[28,2,28,30],[23,2,23,30],[153,42,153,46],[158,42,158,46],[108,42,108,46],[113,42,113,46],[118,42,118,46],[123,42,123,46],[128,42,128,46],[133,42,133,46],[138,42,138,46],[143,42,143,46],[148,42,148,46],[150,2,150,51],[155,2,155,51],[158,2,158,30],[153,2,153,30],[153,31,153,36],[158,31,158,36],[158,37,158,41],[153,37,153,41],[133,37,133,41],[151,2,151,51],[152,2,152,51],[149,2,149,30],[149,31,149,36]]}
[null,null,null,null,null,null,null,null,null,null,null,null,null,null,null,null,null,null,null,null,null,null,null,null,null,null,null,null,null,null,null,null,null,null,null,null,null,null,null,null,null,null,null,null,null,null,null,null,null,null,null,null,null,{"$f":"SUM(BB13:BB161)","v":10},null,null,null,null,null,{"$f":"Deckblatt_Cover!P1","v":2}]
[null,null,{"$f":"CONCATENATE(Checkliste!A2,Checkliste!F2)","v":"Supplier Audit Company Jemison Metals"}]
[null,null,null,null,null,null,null,null,null,null,null,null,null,null,null,null,null,null,null,null,null,null,null,null,null,null,null,null,null,null,null,null,null,null,null,null,null,null,null,null,null,null,null,null,null,null,null,null,null,null,null,null,null,null,{"$f":"CONCATENATE(Checkliste!BA3,Checkliste!BF3)","v":""}]
[null,null,{"$f":"IF($BH$1=1,\"Maßnahmenplan\",\"Action plan\")","v":"Action plan"}]
[]
[]
{"$rows_left_out":157}
{"sheet":"Ausgabe_Output","index":3,"n_rows":161,"n_cols":60,"rows_kept":161,"cut":false,"hidden":true,"merged":[[18,2,18,30],[18,31,18,36],[18,37,18,41],[18,42,18,46],[18,47,18,51],[20,2,20,51],[23,2,23,30],[1,2,1,49],[2,0,2,51],[3,2,3,49],[4,2,4,49],[6,6,6,26],[6,40,6,44],[6,45,6,48],[16,0,19,1],[16,2,16,51],[17,2,17,51],[19,2,19,30],[19,31,19,36],[19,37,19,41],[19,42,19,46],[19,47,19,51],[8,6,8,49],[11,0,14,1],[26,0,29,1],[26,2,26,51],[27,2,27,51],[29,2,29,30],[29,31,29,36],[29,37,29,41],[29,42,29,46],[29,47,29,51],[21,0,24,1],[21,2,21,51],[22,2,22,51],[24,2,24,30],[24,31,24,36],[24,37,24,41],[24,42,24,46],[24,47,24,51],[23,31,23,36],[23,37,23,41],[23,42,23,46],[23,47,23,51],[25,2,25,51],[28,2,28,30],[28,31,28,36],[28,37,28,41],[36,0,39,1],[36,2,36,51],[37,2,37,51],[39,2,39,30],[39,31,39,36],[39,37,39,41],[39,42,39,46],[39,47,39,51],[31,0,34,1],[31,2,31,51],[32,2,32,51],[34,2,34,30],[34,31,34,36],[34,37,34,41],[34,42,34,46],[34,47,34,51],[38,2,38,30],[38,31,38,36],[38,37,38,41],[38,42,38,46],[38,47,38,51],[46,0,49,1],[46,2,46,51],[47,2,47,51],[49,2,49,30],[49,31,49,36],[49,37,49,41],[49,42,49,46],[49,47,49,51],[41,0,44,1],[41,2,41,51],[42,2,42,51],[44,2,44,30],[44,31,44,36],[44,37,44,41],[44,42,44,46],[44,47,44,51],[56,0,59,1],[56,2,56,51],[57,2,57,51],[59,2,59,30],[59,31,59,36],[59,37,59,41],[59,42,59,46],[59,47,59,51],[51,0,54,1],[51,2,51,51],[52,2,52,51],[54,2,54,30],[54,31,54,36],[54,37,54,41],[54,42,54,46],[54,47,54,51],[66,0,69,1],[66,2,66,51],[67,2,67,51],[69,2,69,30],[69,31,69,36],[69,37,69,41],[69,42,69,46],[69,47,69,51],[61,0,64,1],[61,2,61,51],[62,2,62,51],[64,2,64,30],[64,31,64,36],[64,37,64,41],[64,42,64,46],[64,47,64,51],[76,0,79,1],[76,2,76,51],[77,2,77,51],[79,2,79,30],[79,31,79,36],[79,37,79,41],[79,42,79,46],[79,47,79,51],[71,0,74,1],[71,2,71,51],[72,2,72,51],[74,2,74,30],[74,31,74,36],[74,37,74,41],[74,42,74,46],[74,47,74,51],[86,0,89,1],[86,2,86,51],[87,2,87,51],[89,2,89,30],[89,31,89,36],[89,37,89,41],[89,42,89,46],[89,47,89,51],[81,0,84,1],[81,2,81,51],[82,2,82,51],[84,2,84,30],[84,31,84,36],[84,37,84,41],[84,42,84,46],[84,47,84,51],[96,0,99,1],[96,2,96,51],[97,2,97,51],[99,2,99,30],[99,31,99,36],[99,37,99,41],[99,42,99,46],[99,47,99,51],[91,0,94,1],[91,2,91,51],[92,2,92,51],[94,2,94,30],[94,31,94,36],[94,37,94,41],[94,42,94,46],[94,47,94,51],[106,0,109,1],[106,2,106,51],[107,2,107,51],[109,2,109,30],[109,31,109,36],[109,37,109,41],[109,42,109,46],[109,47,109,51],[101,0,104,1],[101,2,101,51],[102,2,102,51],[104,2,104,30],[104,31,104,36],[104,37,104,41],[104,42,104,46],[104,47,104,51],[116,0,119,1],[116,2,116,51],[117,2,117,51],[119,2,119,30],[119,31,119,36],[119,37,119,41],[119,42,119,46],[119,47,119,51],[111,0,114,1],[111,2,111,51],[112,2,112,51],[114,2,114,30],[114,31,114,36],[114,37,114,41],[114,42,114,46],[114,47,114,51],[126,0,129,1],[126,2,126,51],[127,2,127,51],[129,2,129,30],[129,31,129,36],[129,37,129,41],[129,42,129,46],[129,47,129,51],[121,0,124,1],[121,2,121,51],[122,2,122,51],[124,2,124,30],[124,31,124,36],[124,37,124,41],[124,42,124,46],[124,47,124,51],[136,0,139,1],[136,2,136,51],[137,2,137,51],[139,2,139,30],[139,31,139,36],[139,37,139,41],[139,42,139,46],[139,47,139,51],[131,0,134,1],[131,2,131,51],[132,2,132,51],[134,2,134,30],[134,31,134,36],[134,37,134,41],[134,42,134,46],[134,47,134,51],[146,0,149,1],[146,2,146,51],[147,2,147,51],[149,2,149,30],[149,31,149,36],[149,37,149,41],[149,42,149,46],[149,47,149,51],[141,0,144,1],[141,2,141,51],[142,2,142,51],[144,2,144,30],[144,31,144,36],[144,37,144,41],[144,42,144,46],[144,47,144,51],[156,0,159,1],[156,2,156,51],[157,2,157,51],[159,2,159,30],[159,31,159,36],[159,37,159,41],[159,42,159,46],[159,47,159,51],[151,0,154,1],[151,2,151,51],[152,2,152,51],[154,2,154,30],[154,31,154,36],[154,37,154,41],[154,42,154,46],[154,47,154,51],[6,2,6,5],[8,1,8,5],[10,2,10,51],[13,2,13,30],[13,31,13,36],[13,37,13,41],[13,42,13,46],[13,47,13,51],[15,2,15,51],[14,47,14,51],[11,2,11,51],[12,2,12,51],[14,2,14,30],[14,31,14,36],[14,37,14,41],[14,42,14,46],[28,42,28,46],[28,47,28,51],[30,2,30,51],[33,2,33,30],[33,31,33,36],[33,37,33,41],[33,42,33,46],[33,47,33,51],[35,2,35,51],[40,2,40,51],[43,2,43,30],[43,31,43,36],[43,37,43,41],[43,42,43,46],[43,47,43,51],[45,2,45,51],[48,2,48,30],[48,31,48,36],[48,37,48,41],[48,42,48,46],[48,47,48,51],[50,2,50,51],[53,2,53,30],[53,31,53,36],[53,37,53,41],[53,42,53,46],[53,47,53,51],[55,2,55,51],[58,2,58,30],[58,31,58,36],[58,37,58,41],[58,42,58,46],[58,47,58,51],[60,2,60,51],[63,2,63,30],[63,31,63,36],[63,37,63,41],[63,42,63,46],[63,47,63,51],[65,2,65,51],[68,2,68,30],[68,31,68,36],[68,37,68,41],[68,42,68,46],[68,47,68,51],[70,2,70,51],[73,2,73,30],[73,31,73,36],[73,37,73,41],[73,42,73,46],[73,47,73,51],[75,2,75,51],[78,2,78,30],[78,31,78,36],[78,37,78,41],[78,42,78,46],[78,47,78,51],[80,2,80,51],[83,2,83,30],[83,31,83,36],[83,37,83,41],[83,42,83,46],[83,47,83,51],[85,2,85,51],[88,2,88,30],[88,31,88,36],[88,37,88,41],[88,42,88,46],[88,47,88,51],[90,2,90,51],[93,2,93,30],[93,31,93,36],[93,37,93,41],[93,42,93,46],[93,47,93,51],[95,2,95,51],[98,2,98,30],[98,31,98,36],[98,37,98,41],[98,42,98,46],[98,47,98,51],[100,2,100,51],[103,2,103,30],[103,31,103,36],[103,37,103,41],[103,42,103,46],[103,47,103,51],[105,2,105,51],[108,2,108,30],[108,31,108,36],[108,37,108,41],[108,42,108,46],[108,47,108,51],[110,2,110,51],[113,2,113,30],[113,31,113,36],[113,37,113,41],[113,42,113,46],[113,47,113,51],[115,2,115,51],[118,2,118,30],[118,31,118,36],[118,37,118,41],[118,42,118,46],[118,47,118,51],[120,2,120,51],[123,2,123,30],[123,31,123,36],[123,37,123,41],[123,42,123,46],[123,47,123,51],[125,2,125,51],[128,2,128,30],[128,31,128,36],[128,37,128,41],[128,42,128,46],[128,47,128,51],[130,2,130,51],[133,2,133,30],[133,31,133,36],[133,37,133,41],[133,42,133,46],[133,47,133,51],[135,2,135,51],[138,2,138,30],[138,31,138,36],[138,37,138,41],[138,42,138,46],[138,47,138,51],[140,2,140,51],[143,2,143,30],[143,31,143,36],[143,37,143,41],[143,42,143,46],[143,47,143,51],[145,2,145,51],[148,2,148,30],[148,31,148,36],[148,37,148,41],[148,42,148,46],[148,47,148,51],[150,2,150,51],[153,2,153,30],[153,31,153,36],[153,37,153,41],[153,42,153,46],[153,47,153,51],[155,2,155,51],[158,2,158,30],[158,31,158,36],[158,37,158,41],[158,42,158,46],[158,47,158,51]]}
[null,null,null,null,null,null,null,null,null,null,null,null,null,null,null,null,null,null,null,null,null,null,null,null,null,null,null,null,null,null,null,null,null,null,null,null,null,null,null,null,null,null,null,null,null,null,null,null,null,null,null,null,null,null,null,null,null,null,null,{"$f":"Deckblatt_Cover!P1","v":2}]
[null,null,"Lieferantenaudit  Fa. "]
[]
[null,null,{"$f":"IF($BH$1=1,\"Maßnahmenplan\",\"Action plan\")","v":"Action plan"}]
[]
[]
{"$rows_left_out":156}
{"sheet":"Read me","index":4,"n_rows":19,"n_cols":2,"rows_kept":19,"cut":false,"hidden":false,"merged":[]}
[null,"Read me"]
[]
["1.","Select your language with the buttons at the cover. All sheets in this workbook will be changed."]
[]
["2.","Fill in all the main facts at the cover like \"Supplier No.\" or \"Auditmanager\". With filling in your facts there, all cells with the same content will be filled automatically in the whole workbook."]
[]
{"$rows_left_out":14}
{"sheet":"Tabelle1","index":5,"n_rows":13,"n_cols":10,"rows_kept":13,"cut":false,"hidden":true,"merged":[[11,0,11,3],[11,4,11,5],[12,0,12,3],[12,4,12,5],[8,0,8,3],[8,4,8,5],[9,0,9,3],[9,4,9,5],[10,0,10,3],[10,4,10,5]]}
[]
[]
[]
[]
[]
[]
{"$rows_left_out":7}